Mediation Clause
type: Class
alternative label: 调解条款
subclass of: RDe0RKU39BlhcyACJW30ZLc
definition: A mediation clause is a provision in a contract that requires the parties to attempt to resolve any disputes through mediation before pursuing legal action.