C300 Analysis and Advice
type: Class
subclass of: RxX1kaW2JSgeTr8ALPGia2g
definition: This phase includes all tasks associated with analysis of both the facts and research performed (under C100 and C200) and communicating related opinions or advice to clients. Written communication, meetings, and telephone conversations during which advice is conveyed would all be captured by this phase.