Legal Engineering Services
type: Class
subclass of: R9EU57yyGYQyG3GeOJ1VgMr
definition: Legal Engineering Services refers to the provision of consulting and management services specifically tailored to the legal industry.