Amendment of Bylaws Clause
type: Class
alternative label: 修改章程条款
subclass of: R7UiQA8gafbU8G6XKu27y62
definition: An Amendment of Bylaws Clause is a provision within a legal document that allows for changes to be made to the bylaws of an organization or entity.