Acquiror
type: Class
preferred label: M&A Buyer
alternative label: 收购方
subclass of: RjM80CC0FA0G2sKxmlbaJF
hidden label: AQRR
definition: An acquiror is the surviving company or entity once a merger takes place. Also known as an M&A Buyer, an Acquiror is a person or entity that acquires another company or business through a merger or acquisition, and can be classified as a Strategic Buyer, Financial Sponsor, or Management.