Urethane and Other Foam Product (except Polystyrene) Manufacturing
type: Class
subclass of: QMDWyi9LRsu0sEfRO0bH0w
definition: This industry comprises establishments primarily engaged in manufacturing plastics foam products (except polystyrene).