Injury by Fellow Servant
type: Class
alternative label: 同事伤害
subclass of: RBAoFbSK8WP6xJyVrgQd5PZ
subclass of: RCzs34uEQI9f4cuWp3bQO0P
definition: An injury caused by a co-worker or fellow employee, which may be used as a defense in a civil litigation case.