Tobacco Liability Claims
type: Class
alternative label: 烟草责任索赔
subclass of: R7MsH9WtTPf14W1GB1m8zrB
subclass of: R8alUnZrt8GVEzHYhh1KTva
definition: Tobacco Liability Claims are legal claims brought against tobacco companies for harm caused by their products, typically involving allegations of product liability and personal injury.