Exemption of Presumption of Abuse Form
type: Class
alternative label: 豁免滥用推定表格
subclass of: R8zijLH2GH0SxOhIdzeDOs3
definition: A form used in bankruptcy cases to request exemption from the presumption of abuse, which assumes that a debtor's income is too high to qualify for Chapter 7 bankruptcy.