Landscape Buffer Clause
type: Class
alternative label: 景观缓冲条款
subclass of: RDe0RKU39BlhcyACJW30ZLc
definition: A Landscape Buffer Clause is a provision in a contract that requires the preservation of a natural area between two properties to provide a visual or physical barrier.