TR620 Preliminary Amendment - International
type: Class
subclass of: RozngCLFFS3CuoIzXO44N9A
definition: All action associated with revising an application prior to the examination of the application on its merits in the home country of the applicant for an application filed under TR500, including preparation of amendments and revised drawings that does not materially alter the original drawing.