Contact Physical Address
type: Class
alternative label: 联系人物理地址
subclass of: R8QBuMoK1uPFeLW0sg40CdA
definition: A physical location where a person or entity can be reached, which is a subcategory of contact information.