Erzya
type: Class
alternative label: 厄尔兹亚语
subclass of: RDOvAHsvY8TKJ1O1orXPM9o
definition: Erzya is a Finno-Ugric language spoken by the Erzya people in Russia and is a subcategory of the Language class in the ontology.