Benefits a Party
type: Class
alternative label: Contractual Favorability
subclass of: R8zL0uhEOQuxBZcdYyS8ORn
definition: Whom does Contractual Directionality benefit? Example: Party A indemnifying Party B benefits Party B. Example: Party A receiving Party B's goods benefits Party A.