Arkansas Circuit Court - Madison Cty.
type: Class
subclass of: RCEWWtS3nM8GE8R4en1abRz
definition: A court located in Madison County, Arkansas that has jurisdiction over civil and criminal cases within its designated geographical area.