Georgia Superior Court - Mitchell County
type: Class
subclass of: RCBE5bLTCIia7wAstjMsnKO
definition: Georgia Superior Court - Mitchell County: A court of general jurisdiction in the state of Georgia that has the authority to hear and decide civil and criminal cases within Mitchell County.