Knowledge Management Risk
type: Class
subclass of: RxTxaN981tLTsN82qPBcp
definition: The threats and opportunities associated with an organization's collection and management of knowledge, including intellectual property, organizational or operational information and records, and scientific data. This includes the potential for negative consequences arising from an organization's inability to effectively capture, store, share, and leverage its collective knowledge and expertise. This can result from poor knowledge management practices, inadequate systems, or employee turnover, potentially leading to inefficiencies, loss of intellectual capital, or reduced innovation and competitiveness.