CLIENT_COUNTRY
type: Class
subclass of: RDkx69t1kBP7tevuzMMsqha
definition: The concept of CLIENT_COUNTRY refers to the country of origin or location of a client, as defined within the LEDES98BI V5 Format Rev 1-2020 standard for electronic legal invoicing.