New York Court on the Judiciary
type: Class
subclass of: R3391bdB1A2adE51071C7cf7
definition: The New York Court on the Judiciary is a specialized court within the New York State Courts system that is responsible for investigating and disciplining judges who have engaged in misconduct.