Arraignment Cancellation
type: Class
alternative label: 取消提审
subclass of: RCIQhbWQ3g54ivViquznD4o
definition: Arraignment Cancellation refers to the act of revoking or annulling an arraignment, which is a formal reading of criminal charges in court, before a trial takes place.