JB00 Budgeting incl. costs estimates (UK J-CODE)
type: Class
subclass of: RCAZQP6AHCQX7HNZqzV7oIR
definition: All work throughout the life of the case relating to budgeting and costs management, excluding the ‘costs assessment’ and ‘funding’ related work and preparation for and attendance at any costs management hearing, all of which have discrete phases.