Motion to Limit Prior Art
type: Class
alternative label: 限制先前技术的动议
subclass of: R8zwKGkogGKIKWSVWb1ItRL
definition: A Motion to Limit Prior Art is a request made during a trial to restrict the evidence that can be presented by the opposing party to only certain prior art, in order to narrow the issues at trial.