Texas District Court - Angelina County
type: Class
subclass of: RDvQuaxSojEqV7COK0FlBTI
definition: A court located in Angelina County, Texas that has jurisdiction over civil and criminal cases within its geographical boundaries.