Shareholder
type: Class
alternative label: 股东
subclass of: R8hWq9dSn0Su2Y59JE48V3H
hidden label: SHAR
definition: A shareholder, also referred to as a stockholder, is any person, company, or institution that owns at least one share of a company's stock (equity).