Motion for Discovery Sanctions
type: Class
alternative label: 发现制裁动议
subclass of: RBfGu0dj7U3Vhx97y84qzKq
subclass of: RCMIgsCQAdMZUzbk6elcWT2
definition: A Motion for Discovery Sanctions is a legal request made by one party to the court asking for penalties or punishment against the opposing party for failing to comply with the rules of discovery during the pre-trial phase of a lawsuit.