Parent-Child Liability
type: Class
alternative label: 父母子女责任
subclass of: R7XlRtk6WMnbMZULXcg7SnI
definition: The legal concept of Parent-Child Liability refers to the responsibility of a parent for the actions or debts of their child, within the context of Family Liability.