Adult Dependent Abuse
type: Class
alternative label: 成年被抚养者虐待
subclass of: R86KwDCIco0lQwycGRDQ7M1
definition: The mistreatment or harm inflicted upon an adult who is dependent on another person for care or support, such as an elderly or disabled individual, by a caregiver or family member.