Information Statement
type: Class
alternative label: Investor Information Document
alternative label: Shareholder Information Bulletin
subclass of: RmCERXtzdqIJcW9mdbk0Bb
definition: An Information Statement is a document that provides material information about corporate matters that require shareholder action but do not necessitate a shareholder meeting. It is often distributed prior to corporate actions like spin-offs or large asset sales.