PA310 Provisional Application Preparation - Domestic
type: Class
subclass of: RjPfJalsXTL-aarnLtmpQzw
definition: All actions associated with completing a provisional patent application that is to be filed in the ("domestic") home country or region of the applicant, including review of invention disclosure materials and prior art, interviews with the inventors, drafting and revision of application, preparation and execution of formal documentation (such as assignments, transmittals, and biological deposits), filing of application, and reporting to the client. Note that government fees and external expenses (or "disbursements" in the U.S.) are included under E100.