Covered Business Method Review
type: Class
preferred label: CBM Review
alternative label: 覆盖商业方法审查
subclass of: RBqTXginiTXVwXPwiLfOuDR
subclass of: RCQCiKMTNRjrI3JbFdOhXu2
definition: A Covered Business Method Review (CBM) is a type of administrative dispute proceeding practice conducted by the U.S. Patent Trial and Appeal Board (PTAB).