Yupik languages
type: Class
alternative label: 尤皮克语言
subclass of: RDOvAHsvY8TKJ1O1orXPM9o
definition: Yupik languages are a group of indigenous languages spoken in Alaska and Siberia, characterized by complex inflectional systems and polysynthetic word formation.