Bankruptcy Agreement
type: Class
alternative label: 破产协议
subclass of: R88D8i8AcSTUig2X3yPbFHg
subclass of: R8zijLH2GH0SxOhIdzeDOs3
definition: A Bankruptcy Agreement is a legal document that outlines the terms and conditions of an agreement between a debtor and creditor in a bankruptcy or restructuring proceeding.