Surgery Malpractice
type: Class
alternative label: 外科医疗事故
subclass of: R8nVhrBlasGIc7jxw1D0vbm
definition: Surgery Malpractice refers to a type of medical malpractice claim that arises from a surgical procedure that was performed negligently or incompetently, resulting in harm to the patient.