Motion in Limine
type: Class
alternative label: 限制性动议
subclass of: R0EU9KrLDwhmIAsBno5K4c
subclass of: R7SdenAJ4aI0wyuxBsP7c09
definition: A Motion in Limine is a pretrial motion requesting the court to exclude certain evidence or testimony that may be prejudicial or irrelevant to the case.