Maori
type: Class
alternative label: 毛利语
subclass of: RDOvAHsvY8TKJ1O1orXPM9o
definition: Maori (Language) is a structured system of communication that consists of grammar and vocabulary specific to the indigenous people of New Zealand, and is used in legal matters related to this culture.