Oregon Circuit Court
type: Class
subclass of: REFC692441d584AA9b849464
definition: The Oregon Circuit Court is a court of general jurisdiction in the state of Oregon that hears civil and criminal cases within its geographical jurisdiction.