Railroad Rolling Stock Manufacturing Industry
type: Class
alternative label: 铁路机车车辆制造业
subclass of: R8q7pmb15BQ563KmqZxMC3W
hidden label: RAIM
definition: This industry comprises establishments primarily engaged in one or more of the following: (1) manufacturing and/or rebuilding locomotives, locomotive frames and parts; (2) manufacturing railroad, street, and rapid transit cars and car equipment for operation on rails for freight and passenger service; and (3) manufacturing rail layers, ballast distributors, rail tamping equipment and other railway track maintenance equipment.