X117 Court and Governmental Agency Fees
type: Class
subclass of: RtpnOBk4lRnWigpEBBKYUDQ
definition: Any court or governmental agency fees, including UCC, land record filings and property tax. Excludes late fees (X122), publication costs (X123) and patent and trademark filing fees (X203, X204 and X205).