Clean Air Claim
type: Class
alternative label: 清洁空气声明
subclass of: RBeZkopwGsxt3K5BXOgNBNF
subclass of: RYS2M2cunzcjtIHPdPzmUy
definition: A Clean Air Claim is a legal action brought under environmental law seeking to enforce or protect the right to clean air.