No Waiver Clause
type: Class
alternative label: 无放弃条款
subclass of: RDe0RKU39BlhcyACJW30ZLc
definition: A No Waiver Clause is a provision in a contract that states that the failure to enforce a right or remedy does not constitute a waiver of that right or remedy.