Hospitality - Real Estate Asset
type: Class
alternative label: 酒店业 - 房地产资产
subclass of: RUhSbbDJZa8Crs3tIWcIfV
hidden label: HOSPRE
definition: Real estate used in the hospitality industry including hotels, travel centers, water parks, amusement facilities, golf courses, etc.