Sporting Goods, Hobby, Musical Instrument, Book, and Miscellaneous Retailers Industry
type: Class
alternative label: 杂项商店零售业
subclass of: RDfdmGR6iPi4k2t6ecIUBkP
hidden label: MISR
definition: Industries in the Sporting Goods, Hobby, Musical Instrument, Book, and Miscellaneous Retailers subsector retail new sporting goods; new toys, games, and hobby supplies; new sewing supplies and needlework accessories; new musical instruments; new books, newspapers, magazines, and other periodicals; and other specialized lines of merchandise, such as cut flowers and floral arrangements, new office supplies and stationery, new gifts, novelty merchandise, and souvenirs, used merchandise, pets and pet supplies, art, new or used manufactured (mobile) homes, and tobacco, electronic cigarettes, and other smoking supplies.