Clear and Convincing Evidence
type: Class
alternative label: 明确有力的证据
subclass of: RDV74m3ydS2I72hZ88Mf1RX
definition: Clear and Convincing Evidence is a standard of proof that requires evidence to be highly and substantially more probable to be true than not, and leaves no serious or substantial doubt in the mind of the factfinder.