Rebuttal of Presumption of Undue Hardship
type: Class
alternative label: 驳回不当困难推定
subclass of: RXSQ7cfAYqk20qAg9n2wxi
definition: The Rebuttal of Presumption of Undue Hardship is a legal argument made in the context of bankruptcy and restructuring proceedings by a debtor seeking to prove that they are not able to repay their debts without experiencing undue hardship, despite the presumption that they are able to do so.