Estoppel
type: Class
alternative label: 禁言
subclass of: RBAoFbSK8WP6xJyVrgQd5PZ
subclass of: RCzs34uEQI9f4cuWp3bQO0P
subclass of: RWS7oVs9s2563KGt41Lsta
definition: Estoppel is a legal defense that prevents a party from denying or asserting a certain fact or claim due to their own previous actions or statements, which another party relied upon to their detriment.