Life Sciences Patent
type: Class
preferred label: Biotechnology Patent
subclass of: R79ZnCKDSoLOn17LGjAF6G6
definition: A life sciences patent is a legal protection granted to inventors of new and useful inventions in the fields of biology, biotechnology, genetics, and medicine.