Tenant Improvement Allowance Clause
type: Class
alternative label: 承租人装修津贴条款
subclass of: RDe0RKU39BlhcyACJW30ZLc
definition: A Tenant Improvement Allowance Clause is a provision in a contract that specifies the amount of money a landlord will contribute towards the cost of improving a tenant's leased space.