Motion to Restrict Public Access
type: Class
alternative label: 限制公众访问动议
subclass of: R9Ii4OzSADsjS0VegX12oQJ
definition: A Motion to Restrict Public Access is a request made in a bankruptcy case to limit public access to certain information or documents.