Application to Appoint Creditor's Committee
type: Class
alternative label: 任命债权人委员会申请
subclass of: RtSJkLiGzcKx8PVlCAB5q5
definition: An Application to Appoint Creditor's Committee is a formal request made in a bankruptcy case to establish a committee of creditors who will represent the interests of all creditors in the bankruptcy proceedings.