Haida
type: Class
alternative label: 海达人
subclass of: R7N6wsHsNyqgPE4xFK8wKJx
subclass of: RDOvAHsvY8TKJ1O1orXPM9o
definition: Haida (Language) is a structured system of communication spoken by the Haida people, characterized by its unique grammar and vocabulary.